Target
Corticotropin-releasing factor receptor 1
Ligand
BDBM50074459
Substrate
Meas. Tech.
ChEMBL_51114 (CHEMBL664960)
Ki
2.9±n/a nM
Citation
 Chorvat, RJBakthavatchalam, RBeck, JPGilligan, PJWilde, RGCocuzza, AJHobbs, FWCheeseman, RSCurry, MRescinito, JPKrenitsky, PChidester, DYarem, JAKlaczkiewicz, JDHodge, CNAldrich, PEWasserman, ZRFernandez, CHZaczek, RFitzgerald, LWHuang, SMShen, HLWong, YNChien, BMArvanitis, A Synthesis, corticotropin-releasing factor receptor binding affinity, and pharmacokinetic properties of triazolo-, imidazo-, and pyrrolopyrimidines and -pyridines. J Med Chem 42:833-48 (1999)  
Target
Name:
Corticotropin-releasing factor receptor 1
Synonyms:
CRF-R CRF1 CRFR1 CRH-R 1 CRHR1 Corticotropin-releasing factor receptor 1 (CRF-1) Corticotropin-releasing hormone receptor 1
Type:
Enzyme
Mol. Mass.:
50744.31
Organism:
Homo sapiens (Human)
Description:
P34998
Residue:
444
  
Inhibitor
Name:
BDBM50074459
Synonyms:
9-(2-Bromo-4-isopropyl-phenyl)-6-(1-ethyl-pentyloxy)-2-methyl-9H-purine | CHEMBL167017
Type:
Small organic molecule
Emp. Form.:
C22H29BrN4O
Mol. Mass.:
445.396
SMILES:
CCCCC(CC)Oc1nc(C)nc2n(cnc12)-c1ccc(cc1Br)C(C)C
: