Target
Corticotropin-releasing factor receptor 1
Ligand
BDBM50074472
Substrate
Meas. Tech.
ChEMBL_51114 (CHEMBL664960)
Ki
4.3±n/a nM
Citation
 Chorvat, RJBakthavatchalam, RBeck, JPGilligan, PJWilde, RGCocuzza, AJHobbs, FWCheeseman, RSCurry, MRescinito, JPKrenitsky, PChidester, DYarem, JAKlaczkiewicz, JDHodge, CNAldrich, PEWasserman, ZRFernandez, CHZaczek, RFitzgerald, LWHuang, SMShen, HLWong, YNChien, BMArvanitis, A Synthesis, corticotropin-releasing factor receptor binding affinity, and pharmacokinetic properties of triazolo-, imidazo-, and pyrrolopyrimidines and -pyridines. J Med Chem 42:833-48 (1999)  
Target
Name:
Corticotropin-releasing factor receptor 1
Synonyms:
CRF-R CRF1 CRFR1 CRH-R 1 CRHR1 Corticotropin-releasing factor receptor 1 (CRF-1) Corticotropin-releasing hormone receptor 1
Type:
Enzyme
Mol. Mass.:
50744.31
Organism:
Homo sapiens (Human)
Description:
P34998
Residue:
444
  
Inhibitor
Name:
BDBM50074472
Synonyms:
CHEMBL352340 | [9-(2-Bromo-4-isopropyl-phenyl)-2-methyl-9H-purin-6-yl]-butyl-ethyl-amine
Type:
Small organic molecule
Emp. Form.:
C21H28BrN5
Mol. Mass.:
430.385
SMILES:
CCCCN(CC)c1nc(C)nc2n(cnc12)-c1ccc(cc1Br)C(C)C
: