Target
Corticotropin-releasing factor receptor 1
Ligand
BDBM50074528
Substrate
Meas. Tech.
ChEMBL_51114 (CHEMBL664960)
Ki
5.2±n/a nM
Citation
 Chorvat, RJBakthavatchalam, RBeck, JPGilligan, PJWilde, RGCocuzza, AJHobbs, FWCheeseman, RSCurry, MRescinito, JPKrenitsky, PChidester, DYarem, JAKlaczkiewicz, JDHodge, CNAldrich, PEWasserman, ZRFernandez, CHZaczek, RFitzgerald, LWHuang, SMShen, HLWong, YNChien, BMArvanitis, A Synthesis, corticotropin-releasing factor receptor binding affinity, and pharmacokinetic properties of triazolo-, imidazo-, and pyrrolopyrimidines and -pyridines. J Med Chem 42:833-48 (1999)  
Target
Name:
Corticotropin-releasing factor receptor 1
Synonyms:
CRF-R CRF1 CRFR1 CRH-R 1 CRHR1 Corticotropin-releasing factor receptor 1 (CRF-1) Corticotropin-releasing hormone receptor 1
Type:
Enzyme
Mol. Mass.:
50744.31
Organism:
Homo sapiens (Human)
Description:
P34998
Residue:
444
  
Inhibitor
Name:
BDBM50074528
Synonyms:
CHEMBL169577 | [3-(2-Bromo-4-isopropyl-phenyl)-5-methyl-3H-[1,2,3]triazolo[4,5-d]pyrimidin-7-yl]-(1-ethyl-propyl)-amine
Type:
Small organic molecule
Emp. Form.:
C19H25BrN6
Mol. Mass.:
417.346
SMILES:
CCC(CC)Nc1nc(C)nc2n(nnc12)-c1ccc(cc1Br)C(C)C
: