Target
GTPase HRas
Ligand
BDBM50520327
Substrate
Meas. Tech.
ChEMBL_1879629 (CHEMBL4381023)
Kd
51±n/a nM
Citation
 Erlanson, DAde Esch, IJPJahnke, WJohnson, CNMortenson, PN Fragment-to-Lead Medicinal Chemistry Publications in 2018. J Med Chem 63:4430-4444 (2020)  
Target
Name:
GTPase HRas
Synonyms:
GTPase HRas, N-terminally processed H-Ras-1 HRAS1 His6-Ha-Ras-CVLS Transforming protein p21 Wild-type Ha-Ras p21ras
Type:
Other Protein Type
Mol. Mass.:
21293.37
Organism:
Homo sapiens (Human)
Description:
P01112
Residue:
189
  
Inhibitor
Name:
BDBM50520327
Synonyms:
CHEMBL4456044
Type:
Small organic molecule
Emp. Form.:
C23H25N3O3
Mol. Mass.:
391.4629
SMILES:
COc1nc(ccc1Nc1ccc(CN(C)C)cc1)-c1cccc2OCCOc12
: