Target
Neutrophil cytosol factor 1
Ligand
BDBM50007407
Substrate
Meas. Tech.
ChEMBL_1879639 (CHEMBL4381033)
Kd
366000±n/a nM
Citation
 Solbak, SMØZang, JNarayanan, DHøj, LJBucciarelli, SSoftley, CMeier, SLangkilde, AEGotfredsen, CHSattler, MBach, A Developing Inhibitors of the p47phox-p22phox Protein-Protein Interaction by Fragment-Based Drug Discovery. J Med Chem 63:1156-1177 (2020)  
Target
Name:
Neutrophil cytosol factor 1
Synonyms:
47 kDa autosomal chronic granulomatous disease protein NCF-1 NCF1 NOXO2 Neutrophil cytosol factor 1 Nox-organizing protein 2 SH3PXD1A | p47-phox
Type:
PROTEIN
Mol. Mass.:
44694.41
Organism:
Homo sapiens
Description:
ChEMBL_103757
Residue:
390
  
Inhibitor
Name:
BDBM50007407
Synonyms:
1-NP 4-Naphthalen-1-yl-piperazin-1-ium | CHEMBL277120
Type:
Small organic molecule
Emp. Form.:
C14H16N2
Mol. Mass.:
212.2902
SMILES:
C1CN(CCN1)c1cccc2ccccc12
: