Target
Cannabinoid receptor 1
Ligand
BDBM50054467
Substrate
Meas. Tech.
ChEMBL_46817 (CHEMBL657061)
Ki
174±n/a nM
Citation
 Lang, WQin, CLin, SKhanolkar, ADGoutopoulos, AFan, PAbouzid, KMeng, ZBiegel, DMakriyannis, A Substrate specificity and stereoselectivity of rat brain microsomal anandamide amidohydrolase. J Med Chem 42:896-902 (1999)  
Target
Name:
Cannabinoid receptor 1
Synonyms:
Brain-type cannabinoid receptor CB-R CNR1_RAT Cannabinoid receptor Cnr1 | Skr6
Type:
G Protein-Coupled Receptor (GPCR)
Mol. Mass.:
52856.55
Organism:
Rattus norvegicus (rat)
Description:
P20272
Residue:
473
  
Inhibitor
Name:
BDBM50054467
Synonyms:
(5Z,8Z,11Z,14Z)-Icosa-5,8,11,14-tetraenoic acid bis-(2-hydroxy-ethyl)-amide | CHEMBL15948
Type:
Small organic molecule
Emp. Form.:
C24H41NO3
Mol. Mass.:
391.5872
SMILES:
CCCCC\C=C/C\C=C/C\C=C/C\C=C/CCCC(=O)N(CCO)CCO
: