Target
Sodium channel protein type 3 subunit alpha
Ligand
BDBM50520496
Substrate
Meas. Tech.
ChEMBL_1880487 (CHEMBL4381881)
IC50
260±n/a nM
Citation
 Xu, PKaas, QWu, YZhu, XLi, XHarvey, PJZhangsun, DCraik, DJLuo, S Structure and Activity Studies of Disulfide-Deficient Analogues of ?O-Conotoxin GeXIVA. J Med Chem 63:1564-1575 (2020)  
Target
Name:
Sodium channel protein type 3 subunit alpha
Synonyms:
KIAA1356 NAC3 SCN3A_HUMAN Sodium channel alpha subunits; brain (Types I, II, III) Voltage-gated sodium channel subunit alpha Nav1.3 (Nav1.3)
Type:
Protein
Mol. Mass.:
226276.42
Organism:
Homo sapiens (Human)
Description:
Q9NY46
Residue:
2000
  
Inhibitor
Name:
BDBM50520496
Synonyms:
CHEMBL4469517
Type:
Small organic molecule
Emp. Form.:
C106H174N46O30S4
Mol. Mass.:
2701.066
SMILES:
CC(C)[C@H](N)C(=O)NCC(=O)N[C@@H](CCC(O)=O)C(=O)N[C@@H](CCCNC(N)=N)C(=O)N[C@H]1CSSC[C@@H]2NC(=O)[C@H](Cc3c[nH]c4ccccc34)NC(=O)[C@H](CCCNC(N)=N)NC(=O)CNC(=O)[C@H](CSSC[C@H](NC(=O)[C@H](C)NC(=O)[C@H](CCCNC(N)=N)NC(=O)[C@H](CO)NC(=O)[C@H](Cc3cnc[nH]3)NC(=O)[C@H](CC(O)=O)NC(=O)[C@H](CCCNC(N)=N)NC2=O)C(N)=O)NC(=O)CNC(=O)[C@H](CCCNC(N)=N)NC(=O)[C@H](CCCCN)NC(=O)CNC(=O)[C@H](CC(N)=O)NC(=O)[C@H](CCCCN)NC(=O)[C@H](C)NC1=O
: