Target
Bromodomain-containing protein 2
Ligand
BDBM50520653
Substrate
Meas. Tech.
ChEMBL_1881471 (CHEMBL4382970)
IC50
3.5±n/a nM
Citation
 Qin, CHu, YZhou, BFernandez-Salas, EYang, CYLiu, LMcEachern, DPrzybranowski, SWang, MStuckey, JMeagher, JBai, LChen, ZLin, MYang, JZiazadeh, DNXu, FHu, JXiang, WHuang, LLi, SWen, BSun, DWang, S Discovery of QCA570 as an Exceptionally Potent and Efficacious Proteolysis Targeting Chimera (PROTAC) Degrader of the Bromodomain and Extra-Terminal (BET) Proteins Capable of Inducing Complete and Durable Tumor Regression. J Med Chem 61:6685-6704 (2018)  
Target
Name:
Bromodomain-containing protein 2
Synonyms:
BRD2 Bromodomain and extra-terminal motif (BET) Bromodomain-containing protein 2 (BRD2) RING3
Type:
Protein
Mol. Mass.:
88085.95
Organism:
Homo sapiens (Human)
Description:
P25440
Residue:
801
  
Inhibitor
Name:
BDBM50520653
Synonyms:
CHEMBL4555209
Type:
Small organic molecule
Emp. Form.:
C22H19N5OS
Mol. Mass.:
401.484
SMILES:
Cc1nnc2COCc3c(Cc4ccccc4)c(sc3-n12)C#Cc1cnn(C)c1
: