Target
Integrin alpha-V/beta-3
Ligand
BDBM50075566
Substrate
Meas. Tech.
ChEMBL_217641 (CHEMBL818513)
IC50
>10000±n/a nM
Citation
 Olson, RESielecki, TMWityak, JPinto, DJBatt, DGFrietze, WELiu, JTobin, AEOrwat, MJDi Meo, SVHoughton, GCLalka, GKMousa, SARacanelli, ALHausner, EAKapil, RPRabel, SRThoolen, MJReilly, TMAnderson, PSWexler, RR Orally active isoxazoline glycoprotein IIb/IIIa antagonists with extended duration of action. J Med Chem 42:1178-92 (1999)  
Target
Name:
Integrin alpha-V/beta-3
Synonyms:
ITGAV/ITGB3 | Integrin beta-3/Vitronectin receptor alpha
Type:
Enzyme
Mol. Mass.:
Description:
Components:
This complex has 2 components.
Component 1
Name:
Integrin alpha-V
Synonyms:
ITAV_HUMAN Integrin alpha-V/alpha-5 VNRA Vitronectin receptor | Vitronectin receptor subunit alpha
Type:
PROTEIN
Mol. Mass.:
116024.92
Organism:
Homo sapiens (Human)
Description:
ChEMBL_582336
Residue:
1048
  
Component 2
Name:
Integrin beta-3
Synonyms:
CD_antigen=CD61 GPIIIa ITGB3 Platelet membrane glycoprotein IIIa
Type:
Protein
Mol. Mass.:
87038.91
Organism:
Homo sapiens (Human)
Description:
P05106
Residue:
788
  
Inhibitor
Name:
BDBM50075566
Synonyms:
(S)-3-{2-[(R)-3-(4-Carbamimidoyl-phenyl)-4,5-dihydro-isoxazol-5-yl]-acetylamino}-2-(3,5-dimethyl-isoxazole-4-sulfonylamino)-propionic acid; compound with methanesulfonic acid CHEMBL275611
Type:
Small organic molecule
Emp. Form.:
C20H24N6O7S
Mol. Mass.:
492.506
SMILES:
Cc1noc(C)c1S(=O)(=O)N[C@@H](CNC(=O)C[C@H]1CC(=NO1)c1ccc(cc1)C(N)=N)C(O)=O
: