Target
Integrin alpha-IIb/beta-3
Ligand
BDBM50075579
Substrate
Meas. Tech.
ChEMBL_70169 (CHEMBL683389)
Kd
2.4±n/a nM
Citation
 Olson, RESielecki, TMWityak, JPinto, DJBatt, DGFrietze, WELiu, JTobin, AEOrwat, MJDi Meo, SVHoughton, GCLalka, GKMousa, SARacanelli, ALHausner, EAKapil, RPRabel, SRThoolen, MJReilly, TMAnderson, PSWexler, RR Orally active isoxazoline glycoprotein IIb/IIIa antagonists with extended duration of action. J Med Chem 42:1178-92 (1999)  
Target
Name:
Integrin alpha-IIb/beta-3
Synonyms:
Glycoprotein IIb/IIIa
Type:
Mol. Mass.:
Description:
ASSAY_ID of EBI is 30109
Components:
This complex has 2 components.
Component 1
Name:
Integrin beta-3
Synonyms:
CD_antigen=CD61 GPIIIa ITGB3 Platelet membrane glycoprotein IIIa
Type:
Protein
Mol. Mass.:
87038.91
Organism:
Homo sapiens (Human)
Description:
P05106
Residue:
788
  
Component 2
Name:
Integrin alpha-IIb
Synonyms:
CD_antigen=CD41 GPIIb Glycoprotein IIb ITGA2B Integrin alpha-IIb heavy chain Integrin alpha-IIb light chain, form 2 Integrin alpha-V/beta-3 and alpha-IIb/beta 3 | Platelet membrane glycoprotein IIb
Type:
Protein
Mol. Mass.:
113354.85
Organism:
Homo sapiens (Human)
Description:
P08514
Residue:
1039
  
Inhibitor
Name:
BDBM50075579
Synonyms:
(S)-2-Butoxycarbonylamino-3-{2-[(R)-3-(4-carbamimidoyl-phenyl)-4,5-dihydro-isoxazol-5-yl]-acetylamino}-propionic acid methyl ester CHEMBL18301 | DMP-754
Type:
Small organic molecule
Emp. Form.:
C21H29N5O6
Mol. Mass.:
447.4849
SMILES:
CCCCOC(=O)N[C@@H](CNC(=O)C[C@H]1CC(=NO1)c1ccc(cc1)C(N)=N)C(=O)OC
: