Target
Hepatic triacylglycerol lipase
Ligand
BDBM24567
Substrate
Meas. Tech.
ChEMBL_1883777 (CHEMBL4385276)
IC50
3.0±n/a nM
Citation
 Johnson, JATora, GPi, ZPhillips, MYin, XYang, RZhao, LChen, AYTaylor, DSBasso, MRose, ABehnia, KOnorato, JChen, XQAbell, LMLu, HLocke, GCaporuscio, CGalella, MAdam, LPGordon, DWexler, RRFinlay, HJ Sulfonylated Benzothiazoles as Inhibitors of Endothelial Lipase. ACS Med Chem Lett 9:1263-1268 (2018)  
Target
Name:
Hepatic triacylglycerol lipase
Synonyms:
HL Hepatic Lipase (HL) Hepatic triacylglycerol lipase LIPC_HUMAN | Lipase member C
Type:
Protein
Mol. Mass.:
55938.55
Organism:
Homo sapiens (Human)
Description:
P11150
Residue:
499
  
Inhibitor
Name:
BDBM24567
Synonyms:
(2S)-1-[(2S,3S)-3-hexyl-4-oxooxetan-2-yl]tridecan-2-yl (2S)-2-formamido-4-methylpentanoate Orlistat Tetrahydrolipstatin Xenical
Type:
Small organic molecule
Emp. Form.:
C29H53NO5
Mol. Mass.:
495.7348
SMILES:
CCCCCCCCCCC[C@@H](C[C@@H]1OC(=O)[C@H]1CCCCCC)OC(=O)[C@H](CC(C)C)NC=O
: