Target
Presenilin-1
Ligand
BDBM50521240
Substrate
Meas. Tech.
ChEMBL_1883816 (CHEMBL4385315)
EC50
0.013900±n/a nM
Citation
 Blass, BE Bridged Piperidine Derivatives Useful as ?-Secretase Inhibitors for the Treatment of Alzheimer's Disease. ACS Med Chem Lett 10:6-7 (2019)  
Target
Name:
Presenilin-1
Synonyms:
3.4.23.- Gamma-Secretase Subunit Presenilin-1 PS1 PSEN1 PSNL1 Presenilin-1 CTF12 Protein S182
Type:
Mol. Mass.:
52657.13
Organism:
Homo sapiens (Human)
Description:
P49768
Residue:
467
  
Inhibitor
Name:
BDBM50521240
Synonyms:
CHEMBL4535601
Type:
Small organic molecule
Emp. Form.:
C23H27F3N8
Mol. Mass.:
472.5093
SMILES:
[H][C@]12CC[C@]([H])(CN(C1)c1ncnc(C)c1F)[C@H]2Nc1nc(N(CC)c2ccc(F)c(F)c2)n(C)n1
: