Target
Presenilin-1
Ligand
BDBM50521245
Substrate
Meas. Tech.
ChEMBL_1883816 (CHEMBL4385315)
EC50
0.013000±n/a nM
Citation
 Blass, BE Bridged Piperidine Derivatives Useful as ?-Secretase Inhibitors for the Treatment of Alzheimer's Disease. ACS Med Chem Lett 10:6-7 (2019)  
Target
Name:
Presenilin-1
Synonyms:
3.4.23.- Gamma-Secretase Subunit Presenilin-1 PS1 PSEN1 PSNL1 Presenilin-1 CTF12 Protein S182
Type:
Mol. Mass.:
52657.13
Organism:
Homo sapiens (Human)
Description:
P49768
Residue:
467
  
Inhibitor
Name:
BDBM50521245
Synonyms:
CHEMBL4547187
Type:
Small organic molecule
Emp. Form.:
C23H26F2N8
Mol. Mass.:
452.5029
SMILES:
[H][C@]12CC[C@]([H])(CN(C1)c1ncnc(C)c1F)[C@H]2Nc1nc2N(CCCn2n1)c1cccc(F)c1
: