Target
Induced myeloid leukemia cell differentiation protein Mcl-1
Ligand
BDBM50521464
Substrate
Meas. Tech.
ChEMBL_1884337 (CHEMBL4385919)
Ki
0.030±n/a nM
Citation
 Lee, TChristov, PPShaw, STarr, JCZhao, BVeerasamy, NJeon, KOMills, JJBian, ZSensintaffar, JLArnold, ALFogarty, SAPerry, ERamsey, HECook, RSHollingshead, MDavis Millin, MLee, KMKoss, BBudhraja, AOpferman, JTKim, KArteaga, CLMoore, WJOlejniczak, ETSavona, MRFesik, SW Discovery of Potent Myeloid Cell Leukemia-1 (Mcl-1) Inhibitors That Demonstrate in Vivo Activity in Mouse Xenograft Models of Human Cancer. J Med Chem 62:3971-3988 (2019)  
Target
Name:
Induced myeloid leukemia cell differentiation protein Mcl-1
Synonyms:
BCL2L3 Bcl-2-like protein 3 (Mcl-1) Bcl2-L-3 MCL1 Mcl-1 Myeloid cell leukemia sequence 1 (BCL2-related) | mcl1/EAT
Type:
Membrane; Single-pass membrane protein
Mol. Mass.:
37332.87
Organism:
Homo sapiens (Human)
Description:
Q07820
Residue:
350
  
Inhibitor
Name:
BDBM50521464
Synonyms:
CHEMBL4469869 | US11596639, Example 78
Type:
Small organic molecule
Emp. Form.:
C39H39Cl2N5O4
Mol. Mass.:
712.664
SMILES:
C[C@@H]1CN(c2cn(C)c3ccc(cc23)C(O)=O)C(=O)c2c(CCCOc3cc(C)c(Cl)c(C)c3)c3ccc(Cl)c(-c4c(C)nn(C)c4C)c3n12
: