Target
Prostaglandin E2 receptor EP4 subtype
Ligand
BDBM190268
Substrate
Meas. Tech.
ChEMBL_1884835 (CHEMBL4386417)
EC50
2.6±n/a nM
Citation
 Barrett, SDHolt, MCKramer, JBGermain, BHo, CSCiske, FLKornilov, AColombo, JMUzieblo, AO'Malley, JPOwen, TAStein, AJMorano, MI Difluoromethylene at the ?-Lactam ?-Position Improves 11-Deoxy-8-aza-PGE J Med Chem 62:4731-4741 (2019)  
Target
Name:
Prostaglandin E2 receptor EP4 subtype
Synonyms:
PE2R4_HUMAN PGE2 receptor EP4 subtype PTGER4 Prostanoid EP4 receptor
Type:
Enzyme
Mol. Mass.:
53134.53
Organism:
Homo sapiens (Human)
Description:
P35408
Residue:
488
  
Inhibitor
Name:
BDBM190268
Synonyms:
US9180116, 2C
Type:
Small organic molecule
Emp. Form.:
C21H31F2NO4
Mol. Mass.:
399.4719
SMILES:
CCC#CC[C@H](C)[C@H](O)\C=C\[C@H]1CC(F)(F)C(=O)N1CCCCCCC(O)=O
: