Target
Prostaglandin E2 receptor EP4 subtype
Ligand
BDBM50521600
Substrate
Meas. Tech.
ChEMBL_1884837 (CHEMBL4386419)
EC50
0.476000±n/a nM
Citation
 Barrett, SDHolt, MCKramer, JBGermain, BHo, CSCiske, FLKornilov, AColombo, JMUzieblo, AO'Malley, JPOwen, TAStein, AJMorano, MI Difluoromethylene at the ?-Lactam ?-Position Improves 11-Deoxy-8-aza-PGE J Med Chem 62:4731-4741 (2019)  
Target
Name:
Prostaglandin E2 receptor EP4 subtype
Synonyms:
PE2R4_HUMAN PGE2 receptor EP4 subtype PTGER4 Prostanoid EP4 receptor
Type:
Enzyme
Mol. Mass.:
53134.53
Organism:
Homo sapiens (Human)
Description:
P35408
Residue:
488
  
Inhibitor
Name:
BDBM50521600
Synonyms:
CHEMBL4558749
Type:
Small organic molecule
Emp. Form.:
C21H33NO4
Mol. Mass.:
363.491
SMILES:
CCC#CC[C@H](C)[C@H](O)\C=C\[C@H]1CCC(=O)N1CCCCCCC(O)=O
: