Target
Potassium voltage-gated channel subfamily H member 2
Ligand
BDBM50521600
Substrate
Meas. Tech.
ChEMBL_1884876 (CHEMBL4386458)
IC50
29000±n/a nM
Citation
 Barrett, SDHolt, MCKramer, JBGermain, BHo, CSCiske, FLKornilov, AColombo, JMUzieblo, AO'Malley, JPOwen, TAStein, AJMorano, MI Difluoromethylene at the ?-Lactam ?-Position Improves 11-Deoxy-8-aza-PGE J Med Chem 62:4731-4741 (2019)  
Target
Name:
Potassium voltage-gated channel subfamily H member 2
Synonyms:
1,3-beta-glucan synthase component GLS2 ERG Eag-related protein 1 Ether-a-go-go-related gene (HERG) Ether-a-go-go-related gene potassium channel 1 Ether-a-go-go-related gene potassium channel 1 (hERG1) Ether-a-go-go-related protein 1 H-ERG KCNH2 Potassium voltage-gated channel subfamily H member 2 (hERG) Voltage-gated potassium channel subunit Kv11.1 hERG Potassium Channel 1 | putative potassium channel subunit
Type:
Multi-pass membrane protein
Mol. Mass.:
126672.65
Organism:
Homo sapiens (Human)
Description:
Q12809
Residue:
1159
  
Inhibitor
Name:
BDBM50521600
Synonyms:
CHEMBL4558749
Type:
Small organic molecule
Emp. Form.:
C21H33NO4
Mol. Mass.:
363.491
SMILES:
CCC#CC[C@H](C)[C@H](O)\C=C\[C@H]1CCC(=O)N1CCCCCCC(O)=O
: