Target
Prostaglandin E2 receptor EP3 subtype
Ligand
BDBM50142481
Substrate
Meas. Tech.
ChEMBL_1884833 (CHEMBL4386415)
Ki
1175±n/a nM
Citation
 Barrett, SDHolt, MCKramer, JBGermain, BHo, CSCiske, FLKornilov, AColombo, JMUzieblo, AO'Malley, JPOwen, TAStein, AJMorano, MI Difluoromethylene at the ?-Lactam ?-Position Improves 11-Deoxy-8-aza-PGE J Med Chem 62:4731-4741 (2019)  
Target
Name:
Prostaglandin E2 receptor EP3 subtype
Synonyms:
PE2R3_HUMAN PGE2-R Prostaglandin E2 receptor Prostaglandin E2 receptor EP3 subtype (EP3) Prostaglandin E2 receptor EP3D subtype (EP3D) | Prostanoid EP3 receptor
Type:
Enzyme
Mol. Mass.:
43335.03
Organism:
Homo sapiens (Human)
Description:
P43115
Residue:
390
  
Inhibitor
Name:
BDBM50142481
Synonyms:
7-[(R)-2-((E)-(S)-3-Hydroxy-oct-1-enyl)-5-oxo-pyrrolidin-1-yl]-heptanoic acid CHEMBL42027
Type:
Small organic molecule
Emp. Form.:
C19H33NO4
Mol. Mass.:
339.4696
SMILES:
CCCCC[C@H](O)\C=C\[C@H]1CCC(=O)N1CCCCCCC(O)=O
: