Target
Prostaglandin E2 receptor EP3 subtype
Ligand
BDBM190270
Substrate
Meas. Tech.
ChEMBL_1884833 (CHEMBL4386415)
Ki
350±n/a nM
Citation
 Barrett, SDHolt, MCKramer, JBGermain, BHo, CSCiske, FLKornilov, AColombo, JMUzieblo, AO'Malley, JPOwen, TAStein, AJMorano, MI Difluoromethylene at the ?-Lactam ?-Position Improves 11-Deoxy-8-aza-PGE J Med Chem 62:4731-4741 (2019)  
Target
Name:
Prostaglandin E2 receptor EP3 subtype
Synonyms:
PE2R3_HUMAN PGE2-R Prostaglandin E2 receptor Prostaglandin E2 receptor EP3 subtype (EP3) Prostaglandin E2 receptor EP3D subtype (EP3D) | Prostanoid EP3 receptor
Type:
Enzyme
Mol. Mass.:
43335.03
Organism:
Homo sapiens (Human)
Description:
P43115
Residue:
390
  
Inhibitor
Name:
BDBM190270
Synonyms:
US9180116, 9C
Type:
Small organic molecule
Emp. Form.:
C19H31F2NO4
Mol. Mass.:
375.4505
SMILES:
CCCCC[C@H](O)\C=C\[C@H]1CC(F)(F)C(=O)N1CCCCCCC(O)=O
: