Target
Prostaglandin E2 receptor EP4 subtype
Ligand
BDBM50101858
Substrate
Meas. Tech.
ChEMBL_1884837 (CHEMBL4386419)
EC50
0.010000±n/a nM
Citation
 Barrett, SDHolt, MCKramer, JBGermain, BHo, CSCiske, FLKornilov, AColombo, JMUzieblo, AO'Malley, JPOwen, TAStein, AJMorano, MI Difluoromethylene at the ?-Lactam ?-Position Improves 11-Deoxy-8-aza-PGE J Med Chem 62:4731-4741 (2019)  
Target
Name:
Prostaglandin E2 receptor EP4 subtype
Synonyms:
PE2R4_HUMAN PGE2 receptor EP4 subtype PTGER4 Prostanoid EP4 receptor
Type:
Enzyme
Mol. Mass.:
53134.53
Organism:
Homo sapiens (Human)
Description:
P35408
Residue:
488
  
Inhibitor
Name:
BDBM50101858
Synonyms:
4-(2-((1R,2R,3R)-3-hydroxy-2-((S,E)-3-hydroxy-4-(3-(methoxymethyl)phenyl)but-1-enyl)-5-oxocyclopentyl)ethylthio)butanoic acid CHEMBL292964
Type:
Small organic molecule
Emp. Form.:
C23H32O6S
Mol. Mass.:
436.562
SMILES:
COCc1cccc(C[C@H](O)\C=C\[C@H]2[C@H](O)CC(=O)[C@@H]2CCSCCCC(O)=O)c1
: