Target
Prostaglandin E2 receptor EP4 subtype
Ligand
BDBM50142481
Substrate
Meas. Tech.
ChEMBL_1884835 (CHEMBL4386417)
EC50
1.8±n/a nM
Citation
 Barrett, SDHolt, MCKramer, JBGermain, BHo, CSCiske, FLKornilov, AColombo, JMUzieblo, AO'Malley, JPOwen, TAStein, AJMorano, MI Difluoromethylene at the ?-Lactam ?-Position Improves 11-Deoxy-8-aza-PGE J Med Chem 62:4731-4741 (2019)  
Target
Name:
Prostaglandin E2 receptor EP4 subtype
Synonyms:
PE2R4_HUMAN PGE2 receptor EP4 subtype PTGER4 Prostanoid EP4 receptor
Type:
Enzyme
Mol. Mass.:
53134.53
Organism:
Homo sapiens (Human)
Description:
P35408
Residue:
488
  
Inhibitor
Name:
BDBM50142481
Synonyms:
7-[(R)-2-((E)-(S)-3-Hydroxy-oct-1-enyl)-5-oxo-pyrrolidin-1-yl]-heptanoic acid CHEMBL42027
Type:
Small organic molecule
Emp. Form.:
C19H33NO4
Mol. Mass.:
339.4696
SMILES:
CCCCC[C@H](O)\C=C\[C@H]1CCC(=O)N1CCCCCCC(O)=O
: