Target
Prostaglandin E2 receptor EP2 subtype
Ligand
BDBM190268
Substrate
Meas. Tech.
ChEMBL_1884838 (CHEMBL4386420)
EC50
7358±n/a nM
Citation
 Barrett, SDHolt, MCKramer, JBGermain, BHo, CSCiske, FLKornilov, AColombo, JMUzieblo, AO'Malley, JPOwen, TAStein, AJMorano, MI Difluoromethylene at the ?-Lactam ?-Position Improves 11-Deoxy-8-aza-PGE J Med Chem 62:4731-4741 (2019)  
Target
Name:
Prostaglandin E2 receptor EP2 subtype
Synonyms:
PE2R2_HUMAN PTGER2 Prostaglandin E2 receptor Prostanoid EP2 Receptor
Type:
Enzyme
Mol. Mass.:
39775.71
Organism:
Homo sapiens (Human)
Description:
P43116
Residue:
358
  
Inhibitor
Name:
BDBM190268
Synonyms:
US9180116, 2C
Type:
Small organic molecule
Emp. Form.:
C21H31F2NO4
Mol. Mass.:
399.4719
SMILES:
CCC#CC[C@H](C)[C@H](O)\C=C\[C@H]1CC(F)(F)C(=O)N1CCCCCCC(O)=O
: