Target
Integrin alpha-V/beta-3
Ligand
BDBM50076572
Substrate
Meas. Tech.
ChEMBL_214765 (CHEMBL816223)
IC50
900±n/a nM
Citation
 Rockwell, ALRafalski, MPitts, WJBatt, DGPetraitis, JJDeGrado, WFMousa, SJadhav, PK Rapid synthesis of RGD mimetics with isoxazoline scaffolds on solid phase: identification of alphavbeta3 antagonists lead compounds. Bioorg Med Chem Lett 9:937-42 (1999)  
Target
Name:
Integrin alpha-V/beta-3
Synonyms:
ITGAV/ITGB3 | Integrin beta-3/Vitronectin receptor alpha
Type:
Enzyme
Mol. Mass.:
Description:
Components:
This complex has 2 components.
Component 1
Name:
Integrin alpha-V
Synonyms:
ITAV_HUMAN Integrin alpha-V/alpha-5 VNRA Vitronectin receptor | Vitronectin receptor subunit alpha
Type:
PROTEIN
Mol. Mass.:
116024.92
Organism:
Homo sapiens (Human)
Description:
ChEMBL_582336
Residue:
1048
  
Component 2
Name:
Integrin beta-3
Synonyms:
CD_antigen=CD61 GPIIIa ITGB3 Platelet membrane glycoprotein IIIa
Type:
Protein
Mol. Mass.:
87038.91
Organism:
Homo sapiens (Human)
Description:
P05106
Residue:
788
  
Inhibitor
Name:
BDBM50076572
Synonyms:
(S)-2-Benzyloxycarbonylamino-3-{2-[3-(2-guanidino-ethyl)-4,5-dihydro-isoxazol-5-yl]-acetylamino}-propionic acid | CHEMBL173766
Type:
Small organic molecule
Emp. Form.:
C19H26N6O6
Mol. Mass.:
434.4463
SMILES:
NC(=N)NCCC1=NOC(CC(=O)NC[C@H](NC(=O)OCc2ccccc2)C(O)=O)C1
: