Target
Integrin alpha-V/beta-3
Ligand
BDBM50217532
Substrate
Meas. Tech.
ChEMBL_214765 (CHEMBL816223)
IC50
2±n/a nM
Citation
 Rockwell, ALRafalski, MPitts, WJBatt, DGPetraitis, JJDeGrado, WFMousa, SJadhav, PK Rapid synthesis of RGD mimetics with isoxazoline scaffolds on solid phase: identification of alphavbeta3 antagonists lead compounds. Bioorg Med Chem Lett 9:937-42 (1999)  
Target
Name:
Integrin alpha-V/beta-3
Synonyms:
ITGAV/ITGB3 | Integrin beta-3/Vitronectin receptor alpha
Type:
Enzyme
Mol. Mass.:
Description:
Components:
This complex has 2 components.
Component 1
Name:
Integrin alpha-V
Synonyms:
ITAV_HUMAN Integrin alpha-V/alpha-5 VNRA Vitronectin receptor | Vitronectin receptor subunit alpha
Type:
PROTEIN
Mol. Mass.:
116024.92
Organism:
Homo sapiens (Human)
Description:
ChEMBL_582336
Residue:
1048
  
Component 2
Name:
Integrin beta-3
Synonyms:
CD_antigen=CD61 GPIIIa ITGB3 Platelet membrane glycoprotein IIIa
Type:
Protein
Mol. Mass.:
87038.91
Organism:
Homo sapiens (Human)
Description:
P05106
Residue:
788
  
Inhibitor
Name:
BDBM50217532
Synonyms:
CHEMBL3559597
Type:
Small organic molecule
Emp. Form.:
C17H27ClN8O6S
Mol. Mass.:
506.964
SMILES:
[#6]-c1cn(-[#6])[n+](Cl)c1S(=O)(=O)[#7]-[#6@@H](-[#6]-[#7]-[#6](=O)-[#6]-1=[#7]-[#8]-[#6](-[#6]-[#6]-[#6]-[#6]\[#7]=[#6](/[#7])-[#7])-[#6]-1)-[#6](-[#8-])=O
: