Target
Integrin alpha-V/beta-3
Ligand
BDBM50076575
Substrate
Meas. Tech.
ChEMBL_214765 (CHEMBL816223)
IC50
0.700000±n/a nM
Citation
 Rockwell, ALRafalski, MPitts, WJBatt, DGPetraitis, JJDeGrado, WFMousa, SJadhav, PK Rapid synthesis of RGD mimetics with isoxazoline scaffolds on solid phase: identification of alphavbeta3 antagonists lead compounds. Bioorg Med Chem Lett 9:937-42 (1999)  
Target
Name:
Integrin alpha-V/beta-3
Synonyms:
ITGAV/ITGB3 | Integrin beta-3/Vitronectin receptor alpha
Type:
Enzyme
Mol. Mass.:
Description:
Components:
This complex has 2 components.
Component 1
Name:
Integrin alpha-V
Synonyms:
ITAV_HUMAN Integrin alpha-V/alpha-5 VNRA Vitronectin receptor | Vitronectin receptor subunit alpha
Type:
PROTEIN
Mol. Mass.:
116024.92
Organism:
Homo sapiens (Human)
Description:
ChEMBL_582336
Residue:
1048
  
Component 2
Name:
Integrin beta-3
Synonyms:
CD_antigen=CD61 GPIIIa ITGB3 Platelet membrane glycoprotein IIIa
Type:
Protein
Mol. Mass.:
87038.91
Organism:
Homo sapiens (Human)
Description:
P05106
Residue:
788
  
Inhibitor
Name:
BDBM50076575
Synonyms:
3-{5-[4-amino(imino)methylaminobutyl]-4,5-dihydro-3-isoxazolylcarboxamido}-2-mesitylsulfonamido-(2S)-propanoic acid CHEMBL265074
Type:
Small organic molecule
Emp. Form.:
C21H32N6O6S
Mol. Mass.:
496.58
SMILES:
Cc1cc(C)c(c(C)c1)S(=O)(=O)N[C@@H](CNC(=O)C1=NOC(CCCCNC(N)=N)C1)C(O)=O
: