Target
Corticotropin-releasing factor receptor 1
Ligand
BDBM50076602
Substrate
Meas. Tech.
ChEBML_50955
Ki
1.5±n/a nM
Citation
 Beck, JPArvanitis, AGCurry, MARescinito, JTFitzgerald, LWGilligan, PJZaczek, RTrainor, GL Purin-8-ones as corticotropin-releasing hormone (CRH-R1) receptor antagonists. Bioorg Med Chem Lett 9:967-72 (1999)  
Target
Name:
Corticotropin-releasing factor receptor 1
Synonyms:
CRF-R CRF1 CRFR1 CRH-R 1 CRHR1 Corticotropin-releasing factor receptor 1 (CRF-1) Corticotropin-releasing hormone receptor 1
Type:
Enzyme
Mol. Mass.:
50744.31
Organism:
Homo sapiens (Human)
Description:
P34998
Residue:
444
  
Inhibitor
Name:
BDBM50076602
Synonyms:
CHEMBL368772 | [9-(2-Bromo-4-isopropyl-phenyl)-8-chloro-2-methyl-9H-purin-6-yl]-butyl-ethyl-amine
Type:
Small organic molecule
Emp. Form.:
C21H27BrClN5
Mol. Mass.:
464.83
SMILES:
CCCCN(CC)c1nc(C)nc2n(c(Cl)nc12)-c1ccc(cc1Br)C(C)C
: