Target
Corticotropin-releasing factor receptor 1
Ligand
BDBM50076609
Substrate
Meas. Tech.
ChEBML_50955
Ki
4.4±n/a nM
Citation
 Beck, JPArvanitis, AGCurry, MARescinito, JTFitzgerald, LWGilligan, PJZaczek, RTrainor, GL Purin-8-ones as corticotropin-releasing hormone (CRH-R1) receptor antagonists. Bioorg Med Chem Lett 9:967-72 (1999)  
Target
Name:
Corticotropin-releasing factor receptor 1
Synonyms:
CRF-R CRF1 CRFR1 CRH-R 1 CRHR1 Corticotropin-releasing factor receptor 1 (CRF-1) Corticotropin-releasing hormone receptor 1
Type:
Enzyme
Mol. Mass.:
50744.31
Organism:
Homo sapiens (Human)
Description:
P34998
Residue:
444
  
Inhibitor
Name:
BDBM50076609
Synonyms:
6-(Butyl-ethyl-amino)-2,7-dimethyl-9-(2,4,6-trimethyl-phenyl)-7,9-dihydro-purin-8-one | CHEMBL173196
Type:
Small organic molecule
Emp. Form.:
C22H31N5O
Mol. Mass.:
381.5144
SMILES:
CCCCN(CC)c1nc(C)nc2n(-c3c(C)cc(C)cc3C)c(=O)n(C)c12
: