Target
Probable maltase-glucoamylase 2
Ligand
BDBM50502011
Substrate
Meas. Tech.
ChEMBL_1885297 (CHEMBL4386879)
IC50
90±n/a nM
Citation
 Singh, HSingh, JVBhagat, KGulati, HKSanduja, MKumar, NKinarivala, NSharma, S Rational approaches, design strategies, structure activity relationship and mechanistic insights for therapeutic coumarin hybrids. Bioorg Med Chem 27:3477-3510 (2019)  
Target
Name:
Probable maltase-glucoamylase 2
Synonyms:
3.2.1.3 Glucoamylase MGAM2 Probable maltase-glucoamylase 2
Type:
PROTEIN
Mol. Mass.:
277932.17
Organism:
Homo sapiens
Description:
ChEMBL_116927
Residue:
2515
  
Inhibitor
Name:
BDBM50502011
Synonyms:
CHEMBL4463785
Type:
Small organic molecule
Emp. Form.:
C27H18FN3O5S
Mol. Mass.:
515.512
SMILES:
COc1ccccc1N1\C(S\C(=C/c2ccc(F)cc2)C1=O)=N\NC(=O)c1cc2ccccc2oc1=O
: