Target
Protein farnesyltransferase subunit beta/geranylgeranyltransferase type-1 subunit alpha
Ligand
BDBM50076803
Substrate
Meas. Tech.
ChEBML_70117
EC50
>1±n/a nM
Citation
 Augeri, DJJanowick, DKalvin, DSullivan, GLarsen, JDickman, DDing, HCohen, JLee, JWarner, RKovar, PCherian, SSaeed, BZhang, HTahir, SNg, SCSham, HRosenberg, SH Potent and orally bioavailable noncysteine-containing inhibitors of protein farnesyltransferase. Bioorg Med Chem Lett 9:1069-74 (1999)  
Target
Name:
Protein farnesyltransferase subunit beta/geranylgeranyltransferase type-1 subunit alpha
Synonyms:
Farnesyltransferase (FTase) Protein Farnesyltransferase (PFT) Chain B | Protein farnesyltransferase
Type:
Protein Complex
Mol. Mass.:
Description:
To express recombinant enzyme in E. coli, the cloned human alpha and beta subunits were co-expressed from a plasmid, in which their expression was translationally coupled.
Components:
This complex has 2 components.
Component 1
Name:
Protein farnesyltransferase subunit beta
Synonyms:
CAAX farnesyltransferase subunit alpha FNTB FTase-alpha GGTase-I-alpha Protein farnesyl/geranylgeranyl transferase Protein farnesyltransferase subunit beta Protein farnesyltransferase/geranylgeranyltransferase type-1 subunit alpha Ras proteins prenyltransferase subunit beta | Type I protein geranyl-geranyltransferase subunit alpha
Type:
Enzyme Subunit
Mol. Mass.:
48766.02
Organism:
Homo sapiens (Human)
Description:
Protein farnesyltransferase subunit beta
Residue:
437
  
Component 2
Name:
Protein farnesyltransferase/geranylgeranyltransferase type-1 subunit alpha
Synonyms:
CAAX farnesyltransferase alpha subunit FNTA_HUMAN FTase-alpha Geranylgeranyl Transferase (GGTase-I) Chain A Protein Farnesyltransferase (PFT) Chain A Protein farnesyltransferase Protein farnesyltransferase/geranylgeranyltransferase type I alpha subunit | Ras proteins prenyltransferase alpha
Type:
Enzyme
Mol. Mass.:
44392.46
Organism:
Homo sapiens (Human)
Description:
Recombinant human FTase.
Residue:
379
  
Inhibitor
Name:
BDBM50076803
Synonyms:
CHEMBL10970 | Lithium; (S)-2-({5-[5-(2-fluoro-phenyl)-furan-2-ylmethoxymethyl]-2'-methyl-biphenyl-2-carbonyl}-amino)-4-methylsulfanyl-butyrate
Type:
Small organic molecule
Emp. Form.:
C31H29FNO5S
Mol. Mass.:
546.63
SMILES:
CSCC[C@H](NC(=O)c1ccc(COCc2ccc(o2)-c2ccccc2F)cc1-c1ccccc1C)C([O-])=O
: