Target
Prostaglandin G/H synthase 2
Ligand
BDBM50076865
Substrate
Meas. Tech.
ChEBML_51699
IC50
540±n/a nM
Citation
 Carter, JSRogier, DJGraneto, MJSeibert, KKoboldt, CMZhang, YTalley, JJ Design and synthesis of sulfonyl-substituted 4,5-diarylthiazoles as selective cyclooxygenase-2 inhibitors. Bioorg Med Chem Lett 9:1167-70 (1999)  
Target
Name:
Prostaglandin G/H synthase 2
Synonyms:
COX2 Cyclooxygenase 2 (COX-2) Cyclooxygenase-2 (COX-2 AA) Cyclooxygenase-2 (COX-2) PGH2_HUMAN PHS II Prostaglandin E synthase/G/H synthase 2 Prostaglandin-endoperoxide synthase 2
Type:
Enzyme
Mol. Mass.:
69003.89
Organism:
Homo sapiens (Human)
Description:
Recombinant Cox-2 provided by Cayman (Cayman Chemical Co.,Ann Arbor, MI).
Residue:
604
  
Inhibitor
Name:
BDBM50076865
Synonyms:
5-(4-Fluoro-phenyl)-4-(4-methanesulfonyl-phenyl)-2-phenyl-thiazole | CHEMBL280496
Type:
Small organic molecule
Emp. Form.:
C22H16FNO2S2
Mol. Mass.:
409.496
SMILES:
CS(=O)(=O)c1ccc(cc1)-c1nc(sc1-c1ccc(F)cc1)-c1ccccc1
: