Target
Pyrroline-5-carboxylate reductase 1, mitochondrial
Ligand
BDBM50522077
Substrate
Meas. Tech.
ChEMBL_1885981 (CHEMBL4387563)
IC50
99000±n/a nM
Citation
 Milne, KSun, JZaal, EAMowat, JCelie, PHNFish, ABerkers, CRForlani, GLoayza-Puch, FJamieson, CAgami, R A fragment-like approach to PYCR1 inhibition. Bioorg Med Chem Lett 29:2626-2631 (2019)  
Target
Name:
Pyrroline-5-carboxylate reductase 1, mitochondrial
Synonyms:
1.5.1.2 P5CR 1 PYCR1 | Pyrroline-5-carboxylate reductase 1, mitochondrial
Type:
PROTEIN
Mol. Mass.:
33365.79
Organism:
Homo sapiens
Description:
ChEMBL_118247
Residue:
319
  
Inhibitor
Name:
BDBM50522077
Synonyms:
CHEMBL4540573
Type:
Small organic molecule
Emp. Form.:
C10H10BrN
Mol. Mass.:
224.097
SMILES:
Brc1ccc(CNCC#C)cc1
: