Target
Oxytocin receptor
Ligand
BDBM50077039
Substrate
Meas. Tech.
ChEBML_149179
Ki
2.8±n/a nM
Citation
 Williams, PDBock, MGEvans, BEFreidinger, RMGallicchio, SNGuidotti, MTJacobson, MAKuo, MSLevy, MRLis, EVMichelson, SRPawluczyk, JMPerlow, DSPettibone, DJQuigley, AGReiss, DRSalvatore, CStauffer, KJWoyden, CJ Nonpeptide oxytocin antagonists: analogs of L-371,257 with improved potency. Bioorg Med Chem Lett 9:1311-6 (1999)  
Target
Name:
Oxytocin receptor
Synonyms:
OT-R Otr Oxytocin
Type:
Enzyme Catalytic Domain
Mol. Mass.:
42889.28
Organism:
RAT
Description:
Oxytocin OXTR RAT::P70536
Residue:
388
  
Inhibitor
Name:
BDBM50077039
Synonyms:
1-(1-{2-[4-(1-Acetyl-piperidin-4-yloxy)-2-trifluoromethoxy-phenyl]-acetyl}-piperidin-4-yl)-1,4-dihydro-benzo[d][1,3]oxazin-2-one | CHEMBL24682
Type:
Small organic molecule
Emp. Form.:
C29H32F3N3O6
Mol. Mass.:
575.5761
SMILES:
CC(=O)N1CCC(CC1)Oc1ccc(CC(=O)N2CCC(CC2)N2C(=O)OCc3ccccc23)c(OC(F)(F)F)c1
: