Target
Oxytocin receptor
Ligand
BDBM50077040
Substrate
Meas. Tech.
ChEBML_149046
Ki
9.8±n/a nM
Citation
 Williams, PDBock, MGEvans, BEFreidinger, RMGallicchio, SNGuidotti, MTJacobson, MAKuo, MSLevy, MRLis, EVMichelson, SRPawluczyk, JMPerlow, DSPettibone, DJQuigley, AGReiss, DRSalvatore, CStauffer, KJWoyden, CJ Nonpeptide oxytocin antagonists: analogs of L-371,257 with improved potency. Bioorg Med Chem Lett 9:1311-6 (1999)  
Target
Name:
Oxytocin receptor
Synonyms:
OT-R OXYR_HUMAN | Oxytocin
Type:
Enzyme Catalytic Domain
Mol. Mass.:
42793.26
Organism:
Homo sapiens (Human)
Description:
Oxytocin OXTR HEK293::B2R9L7
Residue:
389
  
Inhibitor
Name:
BDBM50077040
Synonyms:
1-(1-{2-[4-(1-Acetyl-piperidin-4-yloxy)-2-methoxy-phenyl]-acetyl}-piperidin-4-yl)-1,4-dihydro-benzo[d][1,3]oxazin-2-one | CHEMBL279230
Type:
Small organic molecule
Emp. Form.:
C29H35N3O6
Mol. Mass.:
521.6047
SMILES:
COc1cc(OC2CCN(CC2)C(C)=O)ccc1CC(=O)N1CCC(CC1)N1C(=O)OCc2ccccc12
: