Target
5'-nucleotidase
Ligand
BDBM50522287
Substrate
Meas. Tech.
ChEMBL_1886273 (CHEMBL4387950)
Ki
2427800±n/a nM
Citation
 Guillon, RRahimova, RPreeti, naEgron, DRouanet, SDumontet, CAghajari, NJordheim, LPChaloin, LPeyrottes, S Lead optimization and biological evaluation of fragment-based cN-II inhibitors. Eur J Med Chem 168:28-44 (2019)  
Target
Name:
5'-nucleotidase
Synonyms:
5'-NT 5NTD_HUMAN Ecto-5'-nucleotidase NT5 NTE
Type:
Enzyme
Mol. Mass.:
63371.54
Organism:
Homo sapiens (Human)
Description:
P21589
Residue:
574
  
Inhibitor
Name:
BDBM50522287
Synonyms:
CHEMBL4438573
Type:
Small organic molecule
Emp. Form.:
C19H16N5O4P
Mol. Mass.:
409.3352
SMILES:
OP(O)(=O)Cn1cnc2c(NC(=O)c3cccc(c3)-c3ccccc3)ncnc12
: