Target
Anthrax toxin receptor 2
Ligand
BDBM50522453
Substrate
Meas. Tech.
ChEMBL_1886716 (CHEMBL4388393)
IC50
>10000±n/a nM
Citation
 G-Doyagüez, ECarrero, PMadrona, ARodriguez-Salamanca, PMartínez-Gualda, BCamarasa, MJJimeno, MLBennallack, PRFinnell, JGTsang, TMChristensen, KASan-Félix, ARogers, MS Galloyl Carbohydrates with Antiangiogenic Activity Mediated by Capillary Morphogenesis Gene 2 (CMG2) Protein Binding. J Med Chem 62:3958-3970 (2019)  
Target
Name:
Anthrax toxin receptor 2
Synonyms:
ANTR2_HUMAN Anthrax toxin receptor 2 CMG2 | Capillary morphogenesis gene 2 protein
Type:
PROTEIN
Mol. Mass.:
53667.55
Organism:
Homo sapiens
Description:
ChEMBL_118453
Residue:
489
  
Inhibitor
Name:
BDBM50522453
Synonyms:
CHEMBL383459
Type:
Small organic molecule
Emp. Form.:
C33H26O21
Mol. Mass.:
758.5469
SMILES:
Oc1cc(cc(O)c1O)C(=O)O[C@@H]1CO[C@@H](OC(=O)c2cc(O)c(O)c(O)c2)[C@H](OC(=O)c2cc(O)c(O)c(O)c2)[C@@H]1OC(=O)c1cc(O)c(O)c(O)c1
: