Target
Suppressor of tumorigenicity 14 protein
Ligand
BDBM50522493
Substrate
Meas. Tech.
ChEMBL_1886799 (CHEMBL4388476)
IC50
25119±n/a nM
Citation
 Walker, ALBingham, RPEdgar, EVFerrie, AHolmes, DSLiddle, JPolyakova, ORella, MSmith, KJThorpe, JHWang, YWhite, GVYoung, RJHovnanian, A Structure guided drug design to develop kallikrein 5 inhibitors to treat Netherton syndrome. Bioorg Med Chem Lett 29:1454-1458 (2019)  
Target
Name:
Suppressor of tumorigenicity 14 protein
Synonyms:
Epithin MT-SP1 PRSS14 SNC19 ST14_HUMAN Suppressor of tumorigenicity 14 protein TADG15
Type:
Single-pass type II membrane protein
Mol. Mass.:
94769.23
Organism:
Homo sapiens (Human)
Description:
Q9Y5Y6
Residue:
855
  
Inhibitor
Name:
BDBM50522493
Synonyms:
CHEMBL4530083
Type:
Small organic molecule
Emp. Form.:
C23H22N6O
Mol. Mass.:
398.4604
SMILES:
NC(=N)c1ccc(NCc2nc(c[nH]2)-c2ccccc2)cc1OCc1cccnc1
: