Target
Epidermal growth factor receptor
Ligand
BDBM373711
Substrate
Meas. Tech.
ChEMBL_1886877 (CHEMBL4388554)
Kd
4.8±n/a nM
Citation
 Mansour, TSPotluri, VPallepati, RRBasetti, VKeesara, MMoghudula, AGMaiti, P Lead generation of 1,2-dithiolanes as exon 19 and exon 21 mutant EGFR tyrosine kinase inhibitors. Bioorg Med Chem Lett 29:1435-1439 (2019)  
Target
Name:
Epidermal growth factor receptor
Synonyms:
EGF Receptor Substrate EGFR_HUMAN ERBB1 Epidermal Growth Factor Receptor erbB-1 Epidermal growth factor receptor (EGFR) HER1 Proto-oncogene c-ErbB-1 Tyrosine-Protein Kinase ErbB-1
Type:
Receptor Kinase Domain
Mol. Mass.:
134279.59
Organism:
Homo sapiens (Human)
Description:
P00533
Residue:
1210
  
Inhibitor
Name:
BDBM373711
Synonyms:
US10246444, Example 40
Type:
Small organic molecule
Emp. Form.:
C30H26ClFN4O3S2
Mol. Mass.:
609.134
SMILES:
CCOc1cc2ncc(C#N)c(Nc3ccc(OCc4cccc(F)c4)c(Cl)c3)c2cc1NC(=O)CC1CCSS1
: