Target
Cytochrome P450 2C8
Ligand
BDBM373711
Substrate
Meas. Tech.
ChEMBL_1886892 (CHEMBL4388569)
IC50
>50000±n/a nM
Citation
 Mansour, TSPotluri, VPallepati, RRBasetti, VKeesara, MMoghudula, AGMaiti, P Lead generation of 1,2-dithiolanes as exon 19 and exon 21 mutant EGFR tyrosine kinase inhibitors. Bioorg Med Chem Lett 29:1435-1439 (2019)  
Target
Name:
Cytochrome P450 2C8
Synonyms:
CP2C8_HUMAN CYPIIC8 P450 IIC2 P450 form 1 | S-mephenytoin 4-hydroxylase
Type:
Protein
Mol. Mass.:
55839.23
Organism:
Homo sapiens (Human)
Description:
P10632
Residue:
490
  
Inhibitor
Name:
BDBM373711
Synonyms:
US10246444, Example 40
Type:
Small organic molecule
Emp. Form.:
C30H26ClFN4O3S2
Mol. Mass.:
609.134
SMILES:
CCOc1cc2ncc(C#N)c(Nc3ccc(OCc4cccc(F)c4)c(Cl)c3)c2cc1NC(=O)CC1CCSS1
: