Target
Tyrosine-protein phosphatase non-receptor type 2
Ligand
BDBM50450001
Substrate
Meas. Tech.
ChEMBL_1886959 (CHEMBL4388636)
IC50
25000±n/a nM
Citation
 Washburn, AAbdeen, SOvechkina, YRay, AMStevens, MChitre, SSivinski, JPark, YJohnson, JHoang, QQChapman, EParish, TJohnson, SM Dual-targeting GroEL/ES chaperonin and protein tyrosine phosphatase B (PtpB) inhibitors: A polypharmacology strategy for treating Mycobacterium tuberculosis infections. Bioorg Med Chem Lett 29:1665-1672 (2019)  
Target
Name:
Tyrosine-protein phosphatase non-receptor type 2
Synonyms:
PTN2_HUMAN PTPT T-cell protein-tyrosine phosphatase TCPTP Tyrosine-protein phosphatase non-receptor type 2 (TC-PTP)
Type:
Protein
Mol. Mass.:
48481.80
Organism:
Homo sapiens (Human)
Description:
P17706
Residue:
415
  
Inhibitor
Name:
BDBM50450001
Synonyms:
CHEMBL4162794
Type:
Small organic molecule
Emp. Form.:
C21H13Cl2N3O5S4
Mol. Mass.:
586.511
SMILES:
Clc1ccc(s1)S(=O)(=O)Nc1ccc(cc1)-c1nc2cc(NS(=O)(=O)c3ccc(Cl)s3)ccc2o1
: