Target
Endothelial lipase
Ligand
BDBM319015
Substrate
Meas. Tech.
ChEMBL_1888474 (CHEMBL4390151)
IC50
7.0±n/a nM
Citation
 Kim, SHJohnson, JAJiang, JParkhurst, BPhillips, MPi, ZQiao, JXTora, GYe Chen, ALiu, EYin, XYang, RZhao, LTaylor, DSBasso, MBehnia, KOnorato, JChen, XQAbell, LMLu, HLocke, GCaporuscio, CAdam, LPGordon, DWexler, RRFinlay, HJ Identification of substituted benzothiazole sulfones as potent and selective inhibitors of endothelial lipase. Bioorg Med Chem Lett 29:1918-1921 (2019)  
Target
Name:
Endothelial lipase
Synonyms:
EDL Endothelial cell-derived lipase LIPG
Type:
Protein
Mol. Mass.:
56805.62
Organism:
Homo sapiens (Human)
Description:
Q9Y5X9
Residue:
500
  
Inhibitor
Name:
BDBM319015
Synonyms:
N-[(cyclopropyl- carbamoyl) methyl]-2-[6-(6- fluoropyridin-3- yl)-1,3- benzothiazol- 2-yl]-2- methanesulfonyl- acetamide | US10173991, Example 57
Type:
Small organic molecule
Emp. Form.:
C20H19FN4O4S2
Mol. Mass.:
462.518
SMILES:
CS(=O)(=O)C(C(=O)NCC(=O)NC1CC1)c1nc2ccc(cc2s1)-c1ccc(F)nc1
: