Target
Hepatic triacylglycerol lipase
Ligand
BDBM50522806
Substrate
Meas. Tech.
ChEMBL_1888463 (CHEMBL4390140)
IC50
52±n/a nM
Citation
 Kim, SHJohnson, JAJiang, JParkhurst, BPhillips, MPi, ZQiao, JXTora, GYe Chen, ALiu, EYin, XYang, RZhao, LTaylor, DSBasso, MBehnia, KOnorato, JChen, XQAbell, LMLu, HLocke, GCaporuscio, CAdam, LPGordon, DWexler, RRFinlay, HJ Identification of substituted benzothiazole sulfones as potent and selective inhibitors of endothelial lipase. Bioorg Med Chem Lett 29:1918-1921 (2019)  
Target
Name:
Hepatic triacylglycerol lipase
Synonyms:
HL Hepatic Lipase (HL) Hepatic triacylglycerol lipase LIPC_HUMAN | Lipase member C
Type:
Protein
Mol. Mass.:
55938.55
Organism:
Homo sapiens (Human)
Description:
P11150
Residue:
499
  
Inhibitor
Name:
BDBM50522806
Synonyms:
CHEMBL4438013
Type:
Small organic molecule
Emp. Form.:
C19H21N3O5S3
Mol. Mass.:
467.582
SMILES:
CS(=O)(=O)C(C(=O)NCCCS(N)(=O)=O)c1nc2ccc(cc2s1)-c1ccccc1
: