Target
Hepatic triacylglycerol lipase
Ligand
BDBM319014
Substrate
Meas. Tech.
ChEMBL_1888463 (CHEMBL4390140)
IC50
79±n/a nM
Citation
 Kim, SHJohnson, JAJiang, JParkhurst, BPhillips, MPi, ZQiao, JXTora, GYe Chen, ALiu, EYin, XYang, RZhao, LTaylor, DSBasso, MBehnia, KOnorato, JChen, XQAbell, LMLu, HLocke, GCaporuscio, CAdam, LPGordon, DWexler, RRFinlay, HJ Identification of substituted benzothiazole sulfones as potent and selective inhibitors of endothelial lipase. Bioorg Med Chem Lett 29:1918-1921 (2019)  
Target
Name:
Hepatic triacylglycerol lipase
Synonyms:
HL Hepatic Lipase (HL) Hepatic triacylglycerol lipase LIPC_HUMAN | Lipase member C
Type:
Protein
Mol. Mass.:
55938.55
Organism:
Homo sapiens (Human)
Description:
P11150
Residue:
499
  
Inhibitor
Name:
BDBM319014
Synonyms:
N-[(cyclopropyl- carbamoyl) methyl]-2-[6-(6- fluoropyridin-3- yl)-1,3- benzothiazol- 2-yl]-2-(3,3,3- trifluoropropane- sulfonyl)acetamide | US10173991, Example 56
Type:
Small organic molecule
Emp. Form.:
C22H20F4N4O4S2
Mol. Mass.:
544.542
SMILES:
Fc1ccc(cn1)-c1ccc2nc(sc2c1)C(C(=O)NCC(=O)NC1CC1)S(=O)(=O)CCC(F)(F)F
: