Target
Hepatic triacylglycerol lipase
Ligand
BDBM319543
Substrate
Meas. Tech.
ChEMBL_1888463 (CHEMBL4390140)
IC50
47±n/a nM
Citation
 Kim, SHJohnson, JAJiang, JParkhurst, BPhillips, MPi, ZQiao, JXTora, GYe Chen, ALiu, EYin, XYang, RZhao, LTaylor, DSBasso, MBehnia, KOnorato, JChen, XQAbell, LMLu, HLocke, GCaporuscio, CAdam, LPGordon, DWexler, RRFinlay, HJ Identification of substituted benzothiazole sulfones as potent and selective inhibitors of endothelial lipase. Bioorg Med Chem Lett 29:1918-1921 (2019)  
Target
Name:
Hepatic triacylglycerol lipase
Synonyms:
HL Hepatic Lipase (HL) Hepatic triacylglycerol lipase LIPC_HUMAN | Lipase member C
Type:
Protein
Mol. Mass.:
55938.55
Organism:
Homo sapiens (Human)
Description:
P11150
Residue:
499
  
Inhibitor
Name:
BDBM319543
Synonyms:
N-[(cyclopropyl- carbamoyl) methyl]-2- methanesulfonyl- 2-(6-phenyl-1,3- benzothiazol- 2-yl)acetamide | US10173991, Example 608
Type:
Small organic molecule
Emp. Form.:
C21H21N3O4S2
Mol. Mass.:
443.539
SMILES:
CS(=O)(=O)C(C(=O)NCC(=O)NC1CC1)c1nc2ccc(cc2s1)-c1ccccc1
: