Target
D(1A) dopamine receptor
Ligand
BDBM50523440
Substrate
Meas. Tech.
ChEMBL_1890366 (CHEMBL4392120)
EC50
1.7±n/a nM
Citation
 Martini, MLLiu, JRay, CYu, XHuang, XPUrs, AUrs, NMcCorvy, JDCaron, MGRoth, BLJin, J Defining Structure-Functional Selectivity Relationships (SFSR) for a Class of Non-Catechol Dopamine D J Med Chem 62:3753-3772 (2019)  
Target
Name:
D(1A) dopamine receptor
Synonyms:
DA D1 receptor DRD1 Dopamine D1 receptor Dopamine D1A
Type:
Enzyme
Mol. Mass.:
49303.43
Organism:
Homo sapiens (Human)
Description:
P21728
Residue:
446
  
Inhibitor
Name:
BDBM50523440
Synonyms:
CHEMBL4572614
Type:
Small organic molecule
Emp. Form.:
C21H13F3N4O2
Mol. Mass.:
410.3487
SMILES:
Cc1ncc2nccn2c1-c1ccc(Oc2nccc3occc23)cc1C(F)(F)F
: