Target
Thiosulfate sulfurtransferase
Ligand
BDBM50140172
Substrate
Meas. Tech.
ChEMBL_1891102 (CHEMBL4392929)
IC50
56000±n/a nM
Citation
 Stevens, MAbdeen, SSalim, NRay, AMWashburn, AChitre, SSivinski, JPark, YHoang, QQChapman, EJohnson, SM HSP60/10 chaperonin systems are inhibited by a variety of approved drugs, natural products, and known bioactive molecules. Bioorg Med Chem Lett 29:1106-1112 (2019)  
Target
Name:
Thiosulfate sulfurtransferase
Synonyms:
2.8.1.1 THTR_HUMAN Thiosulfate sulfurtransferase
Type:
PROTEIN
Mol. Mass.:
33432.06
Organism:
Homo sapiens
Description:
ChEMBL_118080
Residue:
297
  
Inhibitor
Name:
BDBM50140172
Synonyms:
CHEBI:3962 Curcumin | US9409845, Table 1, Compound 21: curcumin
Type:
Small organic molecule
Emp. Form.:
C21H20O6
Mol. Mass.:
368.3799
SMILES:
COc1cc(\C=C\C(=O)CC(=O)\C=C\c2ccc(O)c(OC)c2)ccc1O
: