Target
Thiosulfate sulfurtransferase
Ligand
BDBM50017679
Substrate
Meas. Tech.
ChEMBL_1891102 (CHEMBL4392929)
IC50
>100000±n/a nM
Citation
 Stevens, MAbdeen, SSalim, NRay, AMWashburn, AChitre, SSivinski, JPark, YHoang, QQChapman, EJohnson, SM HSP60/10 chaperonin systems are inhibited by a variety of approved drugs, natural products, and known bioactive molecules. Bioorg Med Chem Lett 29:1106-1112 (2019)  
Target
Name:
Thiosulfate sulfurtransferase
Synonyms:
2.8.1.1 THTR_HUMAN Thiosulfate sulfurtransferase
Type:
PROTEIN
Mol. Mass.:
33432.06
Organism:
Homo sapiens
Description:
ChEMBL_118080
Residue:
297
  
Inhibitor
Name:
BDBM50017679
Synonyms:
Benzyl-(2-chloro-ethyl)-(1-methyl-2-phenoxy-ethyl)-amine Dibenzyline | PHENOXYBENZAMINE
Type:
Small organic molecule
Emp. Form.:
C18H22ClNO
Mol. Mass.:
303.826
SMILES:
CC(COc1ccccc1)N(CCCl)Cc1ccccc1
: