Target
60 kDa heat shock protein, mitochondrial
Ligand
BDBM50052802
Substrate
Meas. Tech.
ChEMBL_1891106 (CHEMBL4392933)
IC50
5800±n/a nM
Citation
 Stevens, MAbdeen, SSalim, NRay, AMWashburn, AChitre, SSivinski, JPark, YHoang, QQChapman, EJohnson, SM HSP60/10 chaperonin systems are inhibited by a variety of approved drugs, natural products, and known bioactive molecules. Bioorg Med Chem Lett 29:1106-1112 (2019)  
Target
Name:
60 kDa heat shock protein, mitochondrial
Synonyms:
3.6.4.9 60 kDa heat shock protein, mitochondrial CPN60 HSP-60 HSP60/HSP10 Heat shock protein 60 Mitochondrial matrix protein P1 | P60 lymphocyte protein
Type:
PROTEIN
Mol. Mass.:
61050.41
Organism:
Homo sapiens
Description:
ChEMBL_117701
Residue:
573
  
Inhibitor
Name:
BDBM50052802
Synonyms:
CHEBI:77181 Crystal violet (15) | Hexamethyl pararosaniline
Type:
Small organic molecule
Emp. Form.:
C25H30N3
Mol. Mass.:
372.5253
SMILES:
[#6]-[#7](-[#6])-c1ccc(cc1)-[#6](=[#6]-1\[#6]=[#6]/[#6](/[#6]=[#6]-1)=[#7+](\[#6])-[#6])\c1ccc(cc1)-[#7](-[#6])-[#6]
: