Target
Thiosulfate sulfurtransferase
Ligand
BDBM50523760
Substrate
Meas. Tech.
ChEMBL_1891102 (CHEMBL4392929)
IC50
8500±n/a nM
Citation
 Stevens, MAbdeen, SSalim, NRay, AMWashburn, AChitre, SSivinski, JPark, YHoang, QQChapman, EJohnson, SM HSP60/10 chaperonin systems are inhibited by a variety of approved drugs, natural products, and known bioactive molecules. Bioorg Med Chem Lett 29:1106-1112 (2019)  
Target
Name:
Thiosulfate sulfurtransferase
Synonyms:
2.8.1.1 THTR_HUMAN Thiosulfate sulfurtransferase
Type:
PROTEIN
Mol. Mass.:
33432.06
Organism:
Homo sapiens
Description:
ChEMBL_118080
Residue:
297
  
Inhibitor
Name:
BDBM50523760
Synonyms:
CHEMBL4448756
Type:
Small organic molecule
Emp. Form.:
C34H28N6Na4O16S4
Mol. Mass.:
996.836
SMILES:
[Na;v0+].[Na;v0+].[Na;v0+].[Na;v0+].[#6]-[#8]-c1cc(ccc1\[#7]=[#7]\c1ccc2c(cc(c(-[#7])c2c1-[#8])S([#8])([#8])[#8-])S([#8])([#8])[#8-])-c1ccc(\[#7]=[#7]\c2ccc3c(cc(c(-[#7])c3c2-[#8])S([#8-])(=O)=O)S([#8-])(=O)=O)c(-[#8]-[#6])c1
: