Target
60 kDa heat shock protein, mitochondrial
Ligand
BDBM50523760
Substrate
Meas. Tech.
ChEMBL_1891106 (CHEMBL4392933)
IC50
6800±n/a nM
Citation
 Stevens, MAbdeen, SSalim, NRay, AMWashburn, AChitre, SSivinski, JPark, YHoang, QQChapman, EJohnson, SM HSP60/10 chaperonin systems are inhibited by a variety of approved drugs, natural products, and known bioactive molecules. Bioorg Med Chem Lett 29:1106-1112 (2019)  
Target
Name:
60 kDa heat shock protein, mitochondrial
Synonyms:
3.6.4.9 60 kDa heat shock protein, mitochondrial CPN60 HSP-60 HSP60/HSP10 Heat shock protein 60 Mitochondrial matrix protein P1 | P60 lymphocyte protein
Type:
PROTEIN
Mol. Mass.:
61050.41
Organism:
Homo sapiens
Description:
ChEMBL_117701
Residue:
573
  
Inhibitor
Name:
BDBM50523760
Synonyms:
CHEMBL4448756
Type:
Small organic molecule
Emp. Form.:
C34H28N6Na4O16S4
Mol. Mass.:
996.836
SMILES:
[Na;v0+].[Na;v0+].[Na;v0+].[Na;v0+].[#6]-[#8]-c1cc(ccc1\[#7]=[#7]\c1ccc2c(cc(c(-[#7])c2c1-[#8])S([#8])([#8])[#8-])S([#8])([#8])[#8-])-c1ccc(\[#7]=[#7]\c2ccc3c(cc(c(-[#7])c3c2-[#8])S([#8-])(=O)=O)S([#8-])(=O)=O)c(-[#8]-[#6])c1
: