Target
Neuropeptide Y receptor type 1
Ligand
BDBM50078957
Substrate
Meas. Tech.
ChEMBL_143983 (CHEMBL752582)
Ki
36±n/a nM
Citation
 Murakami, YHara, HOkada, THashizume, HKii, MIshihara, YIshikawa, MShimamura, MMihara, SKato, GHanasaki, KHagishita, SFujimoto, M 1,3-Disubstituted benzazepines as novel, potent, selective neuropeptide Y Y1 receptor antagonists. J Med Chem 42:2621-32 (1999)  
Target
Name:
Neuropeptide Y receptor type 1
Synonyms:
NPY-Y1 NPY1R NPYR neuropeptide Y receptor Y1
Type:
Enzyme Catalytic Domain
Mol. Mass.:
44399.07
Organism:
Homo sapiens (Human)
Description:
NPY-Y1 NPY1R HUMAN::P25929
Residue:
384
  
Inhibitor
Name:
BDBM50078957
Synonyms:
1-(3-{3-[N'-(4-Hydroxy-phenyl)-N''-isopropyl-guanidino]-2-oxo-2,3,4,5-tetrahydro-benzo[b]azepin-1-ylmethyl}-phenyl)-3-isopropyl-urea | CHEMBL313007
Type:
Small organic molecule
Emp. Form.:
C31H38N6O3
Mol. Mass.:
542.6718
SMILES:
CC(C)NC(=O)Nc1cccc(CN2c3ccccc3CCC(N=C(NC(C)C)Nc3ccc(O)cc3)C2=O)c1
: